{"text_format":"1","workbook":"xlsx","n_sheets":7,"sheets":["Hinweise","Stammdaten","GMW","GA","UG","Andere","mögliche Weidetage berechnen"],"not_rendered":{"charts":0,"images":1,"macros":1,"external_links":0,"defined_names":12,"comments":0,"pivot_tables":0},"unopened":[],"bounds":{"document_bytes":16777216,"sheet_cells":100000,"rows_first":2000,"rows_last":500,"rows_between":2000,"halvings":0,"cell_chars":16384,"cell_head_chars":4096},"cells_cut":0,"cells_raw":0,"read":"whole","date_system":"1900"}

{"sheet":"Hinweise","index":0,"n_rows":28,"n_cols":6,"rows_kept":28,"cut":false,"hidden":false,"merged":[]}
["Folgende Hinweise sind zu beachten:",null,null,null,null,"Aktualisierung: 04.02.2021 "]
[]
[null,null,"=","Auswahlfeld"]
[]
[null,null,"=","Eingabefelder"]
[]
[null,null,"=","Pflicht-Eingabefelder"]
[]
[null,"Datum","=","Datum als TT.MM ohne Punkt hinter dem Monat eingeben. Sofern kein Alterswechsel, Datum 1.1 bis 31.12 (bei ganzj. Beweidung)  oder Beginn und Ende der Beweidung eingeben. Bei Alterswechsel für jeden Zeitraum neue Spalte benutzen, Ergebnis im unteren Zeilenblock."]
[]
[null,"unvollständige Angaben ","=","falsches Ergebnis"]
[]
[null,"Programmteile","=","die spezifischen Vorgaben sind in den verschiedenen Arbeitsblättern abgebildet"]
[]
[null,"GMW","=","Vertragsnaturschutz Mähwiesen und Weiden"]
[]
[null,"GA","=","Vertragsnaturschutz artenreiches Grünland"]
[]
[null,"UG","=","Umweltschonende Grünlandbewirtschaftung im Unternehmen"]
[]
[null,"Wechsel","=","Wechsel der Alterstufen im Betrachtungszeitraum"]
[]
[null,"Bsp","=","Darstellung mit Beispielsdaten"]
[]
[]
[null,"weitere Spalte nötig","=","Spalte markieren, kopieren und beliebig oft innerhalb des Bereiches (bis Spalte Q) einfügen. Somit wird die Berechnung automatisch angepasst."]
[]
[null,"mit Alterswechsel im Beweidungszeitraum","=","findet ein Alterwechsel im Betrachtungszeitraum statt, muss die Berechnung im unteren Zeilenblock kontrolliert werden."]

{"sheet":"Stammdaten","index":1,"n_rows":59,"n_cols":5,"rows_kept":59,"cut":false,"hidden":false,"merged":[]}
[]
["Tiergruppen","RGV"]
["Kälber und Jungvieh unter 6 Monate",0.4]
["Rinder von 6 Monaten bis 2 Jahren",0.6]
["Rinder von mehr als 2 Jahren / Milchkühe",1]
["Schafe ",0.15]
["Ziegen",0.15]
["Mutterdamtiere",0.2]
["Lamas",0.4]
["Alpakas und Guanakos",0.3]
["Einhufer von mehr als 6 Monaten",1]
["Leichte Einhufer, Ponyrassen und Zwergesel (Stockmaß bis einschl. 1,40 m) z.B. Deutsches Reitpony, Islandpferd und Connemara Pony",0.7]
["mittlere und schwere Einhufer, z.B. Araber,  Vollblüter, Quarter Horse und Deutsche Warm- und Kaltblüter",1]
[]
[]
["Grenzen","GMW","GA","UG"]
["Max. Viehbesatz Durchschnitt Jahr - Weide",1.2,1]
["Max. Viehbesatz Durchschnitt Jahr - Mähweide",0.6,0.5]
["Max. Viehbesatz pro Tag - ganzj. Beweidung, 15.11 - 30.04 (GMW) / 31.05.(GA) ",0.6,0.6]
["Min. Viehbesatz Durchschnitt Jahr - Weide",0.3,0.3]
["Min. Viehbesatz pro Tag",null,null,0.3]
["Max. Viehbesatz pro Tag",null,null,1.4]
["Max. Viehbesatz pro Tag Zusatzmodul Extensiv",null,null,1]
["Max. GVE pro ha Zusatzmodul Extensiv",null,null,1]
["Max. GVE pro ha",null,null,1.4]
[]
["Tiergruppe","GVE"]
["Ferkel",0.02]
["Mastschweine bei Betrachtung der gesamten Mastdauer",0.13]
["Läufer (20-50 kg)",0.06]
{"$rows_left_out":30}
{"sheet":"GMW","index":2,"n_rows":45,"n_cols":17,"rows_kept":45,"cut":false,"hidden":false,"merged":[]}
["Jahr"]
["Betrieb"]
["Schlag"]
["Nutzungart (Weide, Mähweide, ganzjährig)"]
["Flächengröße  ha"]
["Datum Auftrieb oder Alterswechsel"]
["Datum Abtrieb oder Alterswechsel"]
["Tiergruppen","RGV","Tiere","Tiere","Tiere","Tiere","Tiere","Tiere","Tiere","Tiere","Tiere","Tiere","Tiere","Tiere","Tiere","Tiere","Tiere"]
[]
[null,{"$f":"IF(ISERROR(VLOOKUP(A10,Stammdaten!$A$3:$B$13,2,FALSE)),\"\",VLOOKUP(A10,Stammdaten!$A$3:$B$13,2,FALSE))","v":""}]
[null,{"$f":"IF(ISERROR(VLOOKUP(A11,Stammdaten!$A$3:$B$13,2,FALSE)),\"\",VLOOKUP(A11,Stammdaten!$A$3:$B$13,2,FALSE))","v":""}]
[null,{"$f":"IF(ISERROR(VLOOKUP(A12,Stammdaten!$A$3:$B$13,2,FALSE)),\"\",VLOOKUP(A12,Stammdaten!$A$3:$B$13,2,FALSE))","v":""}]
[null,{"$f":"IF(ISERROR(VLOOKUP(A13,Stammdaten!$A$3:$B$13,2,FALSE)),\"\",VLOOKUP(A13,Stammdaten!$A$3:$B$13,2,FALSE))","v":""}]
[null,{"$f":"IF(ISERROR(VLOOKUP(A14,Stammdaten!$A$3:$B$13,2,FALSE)),\"\",VLOOKUP(A14,Stammdaten!$A$3:$B$13,2,FALSE))","v":""}]
[null,{"$f":"IF(ISERROR(VLOOKUP(A15,Stammdaten!$A$3:$B$13,2,FALSE)),\"\",VLOOKUP(A15,Stammdaten!$A$3:$B$13,2,FALSE))","v":""}]
[null,{"$f":"IF(ISERROR(VLOOKUP(A16,Stammdaten!$A$3:$B$13,2,FALSE)),\"\",VLOOKUP(A16,Stammdaten!$A$3:$B$13,2,FALSE))","v":""}]
["Summe RGV",null,{"$f":"SUMPRODUCT($B$10:$B$15,C10:C15)","v":0},{"$f":"SUMPRODUCT($B$10:$B$15,D10:D15)","v":0},{"$f":"SUMPRODUCT($B$10:$B$15,E10:E15)","v":0},0,0,0,0,0,0,0,0,0,0,0,0]
["Anzahl Weidetage",null,{"$f":"DAYS360(C6,C7)","v":0},0,0,0,0,0,0,0,0,0,0,0,0,0,0]
["ohne Alterswechsel im Beweidungszeitraum"]
["Viehbesatz pro Tag ",null,{"$f":"IF(ISBLANK(C$5),\"\",(C$17/C$5))","v":""},"","","","","","","","","","","","","",""]
["Viehbesatz Durchschnitt Jahr",null,{"$f":"IF(ISBLANK(C$5),\"\",C$17/C$5/360*C$18)","v":""},"","","","","","","","","","","","","",""]
[{"$f":"Stammdaten!$A$20","v":"Min. Viehbesatz Durchschnitt Jahr - Weide"},{"$f":"Stammdaten!$B$20","v":0.3},{"$f":"IF(ISBLANK(C$5),\"\",IF(C21<$B$29,\"zu gering\",\"OK\"))","v":""},{"$f":"IF(ISBLANK(D$5),\"\",IF(D21<$B$29,\"zu gering\",\"OK\"))","v":""},"","","","","","","","","","","","",""]
[{"$f":"Stammdaten!$A$17","v":"Max. Viehbesatz Durchschnitt Jahr - Weide"},{"$f":"Stammdaten!$B$17","v":1.2},{"$f":"IF(ISBLANK(C$5),\"\",IF(C21>$B$23,\"zu hoch\",\"OK\"))","v":""},{"$f":"IF(ISBLANK(D$5),\"\",IF(D21>$B$23,\"zu hoch\",\"OK\"))","v":""},"","","","","","","","","","","","",""]
[{"$f":"Stammdaten!$A$18","v":"Max. Viehbesatz Durchschnitt Jahr - Mähweide"},{"$f":"Stammdaten!$B$18","v":0.6},{"$f":"IF(ISBLANK(C$5),\"\",IF(C21>$B$24,\"zu hoch\",\"OK\"))","v":""},{"$f":"IF(ISBLANK(D$5),\"\",IF(D21>$B$24,\"zu hoch\",\"OK\"))","v":""},"","","","","","","","","","","","",""]
[{"$f":"Stammdaten!$A$19","v":"Max. Viehbesatz pro Tag - ganzj. Beweidung, 15.11 - 30.04 (GMW) / 31.05.(GA) "},{"$f":"Stammdaten!$B$19","v":0.6},{"$f":"IF(ISBLANK(C$5),\"\",IF(C20>$B$25,\"zu hoch\",\"OK\"))","v":""},{"$f":"IF(ISBLANK(D$5),\"\",IF(D20>$B$25,\"zu hoch\",\"OK\"))","v":""},"","","","","","","","","","","","",""]
["mit Alterswechsel im Beweidungszeitraum"]
["Viehbesatz Summe pro Zeitraum",null,{"$f":"IF(ISBLANK(C$5),\"\",C20*C18)","v":""},{"$f":"IF(ISBLANK(D$5),\"\",D20*D18)","v":""},"","","","","","","","","","","","",""]
["Viehbesatz Durchschnitt Jahr",null,{"$f":"IF(ISBLANK(C5),\"\",SUM(C27:Q27)/360)","v":""}]
[{"$f":"Stammdaten!$A$20","v":"Min. Viehbesatz Durchschnitt Jahr - Weide"},{"$f":"Stammdaten!$B$20","v":0.3},{"$f":"IF(ISBLANK(C$5),\"\",IF(C28<$B$29,\"zu gering\",\"OK\"))","v":""}]
[{"$f":"Stammdaten!$A$17","v":"Max. Viehbesatz Durchschnitt Jahr - Weide"},{"$f":"Stammdaten!$B$17","v":1.2},{"$f":"IF(ISBLANK(C$5),\"\",IF(C28>$B$30,\"zu hoch\",\"OK\"))","v":""}]
{"$rows_left_out":16}
{"sheet":"GA","index":3,"n_rows":46,"n_cols":17,"rows_kept":46,"cut":false,"hidden":false,"merged":[]}
["Jahr"]
["Betrieb"]
["Schlag"]
["Nutzungart (Weide, Mähweide, ganzjährig)"]
["Flächengröße  ha"]
["Datum Auftrieb oder Alterswechsel"]
["Datum Abtrieb oder Alterswechsel"]
["Tiergruppen","RGV","Tiere","Tiere","Tiere","Tiere","Tiere","Tiere","Tiere","Tiere","Tiere","Tiere","Tiere","Tiere","Tiere","Tiere","Tiere"]
[]
[null,{"$f":"IF(ISERROR(VLOOKUP(A10,Stammdaten!$A$3:$B$13,2,FALSE)),\"\",VLOOKUP(A10,Stammdaten!$A$3:$B$13,2,FALSE))","v":""}]
[null,{"$f":"IF(ISERROR(VLOOKUP(A11,Stammdaten!$A$3:$B$13,2,FALSE)),\"\",VLOOKUP(A11,Stammdaten!$A$3:$B$13,2,FALSE))","v":""}]
[null,{"$f":"IF(ISERROR(VLOOKUP(A12,Stammdaten!$A$3:$B$13,2,FALSE)),\"\",VLOOKUP(A12,Stammdaten!$A$3:$B$13,2,FALSE))","v":""}]
[null,{"$f":"IF(ISERROR(VLOOKUP(A13,Stammdaten!$A$3:$B$13,2,FALSE)),\"\",VLOOKUP(A13,Stammdaten!$A$3:$B$13,2,FALSE))","v":""}]
[null,{"$f":"IF(ISERROR(VLOOKUP(A14,Stammdaten!$A$3:$B$13,2,FALSE)),\"\",VLOOKUP(A14,Stammdaten!$A$3:$B$13,2,FALSE))","v":""}]
[null,{"$f":"IF(ISERROR(VLOOKUP(A15,Stammdaten!$A$3:$B$13,2,FALSE)),\"\",VLOOKUP(A15,Stammdaten!$A$3:$B$13,2,FALSE))","v":""}]
[null,null,50]
["Summe RGV",null,{"$f":"SUMPRODUCT($B$10:$B$15,C10:C15)","v":0},{"$f":"SUMPRODUCT($B$10:$B$15,D10:D15)","v":0},0,0,0,0,0,0,0,0,0,0,0,0,0]
["Anzahl Weidetage",null,{"$f":"DAYS360(C6,C7)","v":0},0,0,0,0,0,0,0,0,0,0,0,0,0,0]
["ohne Alterswechsel im Beweidungszeitraum"]
["Viehbesatz pro Tag ",null,{"$f":"IF(ISBLANK(C$5),\"\",(C$17/C$5))","v":""},"","","","","","","","","","","","","",""]
["Viehbesatz Durchschnitt Jahr",null,{"$f":"IF(ISBLANK(C$5),\"\",C$17/C$5/360*C$18)","v":""},{"$f":"IF(ISBLANK(D$5),\"\",D$17/D$5/360*D$18)","v":""},"","","","","","","","","","","","",""]
[{"$f":"Stammdaten!$A$20","v":"Min. Viehbesatz Durchschnitt Jahr - Weide"},{"$f":"Stammdaten!$C$20","v":0.3},{"$f":"IF(ISBLANK(C$5),\"\",IF(C21<$B$29,\"zu gering\",\"OK\"))","v":""},{"$f":"IF(ISBLANK(D$5),\"\",IF(D21<$B$29,\"zu gering\",\"OK\"))","v":""},"","","","","","","","","","","","",""]
[{"$f":"Stammdaten!$A$17","v":"Max. Viehbesatz Durchschnitt Jahr - Weide"},{"$f":"Stammdaten!$C$17","v":1},{"$f":"IF(ISBLANK(C$5),\"\",IF(C21>$B$23,\"zu hoch\",\"OK\"))","v":""},{"$f":"IF(ISBLANK(D$5),\"\",IF(D21>$B$23,\"zu hoch\",\"OK\"))","v":""},"","","","","","","","","","","","",""]
[{"$f":"Stammdaten!$A$18","v":"Max. Viehbesatz Durchschnitt Jahr - Mähweide"},{"$f":"Stammdaten!$C$18","v":0.5},{"$f":"IF(ISBLANK(C$5),\"\",IF(C21>$B$24,\"zu hoch\",\"OK\"))","v":""},{"$f":"IF(ISBLANK(D$5),\"\",IF(D21>$B$24,\"zu hoch\",\"OK\"))","v":""},"","","","","","","","","","","","",""]
[{"$f":"Stammdaten!$A$19","v":"Max. Viehbesatz pro Tag - ganzj. Beweidung, 15.11 - 30.04 (GMW) / 31.05.(GA) "},{"$f":"Stammdaten!$C$19","v":0.6},{"$f":"IF(ISBLANK(C$5),\"\",IF(C20>$B$25,\"zu hoch\",\"OK\"))","v":""},{"$f":"IF(ISBLANK(D$5),\"\",IF(D20>$B$25,\"zu hoch\",\"OK\"))","v":""},"","","","","","","","","","","","",""]
["mit Alterswechsel im Beweidungszeitraum"]
["Viehbesatz Summe pro Zeitraum",null,{"$f":"IF(ISBLANK(C$5),\"\",C20*C18)","v":""},{"$f":"IF(ISBLANK(D$5),\"\",D20*D18)","v":""},{"$f":"IF(ISBLANK(E$5),\"\",E20*E18)","v":""},"","","","","","","","","","","",""]
["Viehbesatz Durchschnitt Jahr",null,{"$f":"SUM(C27:Q27)/360","v":0}]
[{"$f":"Stammdaten!$A$20","v":"Min. Viehbesatz Durchschnitt Jahr - Weide"},{"$f":"Stammdaten!$C$20","v":0.3},{"$f":"IF(ISBLANK(C$28),\"\",IF(C28<$B$29,\"zu gering\",\"OK\"))","v":"zu gering"}]
[{"$f":"Stammdaten!$A$17","v":"Max. Viehbesatz Durchschnitt Jahr - Weide"},{"$f":"Stammdaten!$C$17","v":1},{"$f":"IF(ISBLANK(C$28),\"\",IF(C28>$B$30,\"zu hoch\",\"OK\"))","v":"OK"}]
{"$rows_left_out":17}
{"sheet":"UG","index":4,"n_rows":70,"n_cols":14,"rows_kept":70,"cut":false,"hidden":false,"merged":[[33,2,33,3],[24,2,24,3],[21,0,21,3],[18,2,18,3],[1,4,1,5],[2,4,2,5],[3,4,3,5],[4,4,4,5],[25,2,25,3],[14,2,14,3],[15,2,15,3],[1,2,1,3],[2,2,2,3],[22,2,22,3],[3,2,3,3],[4,2,4,3],[16,2,16,3],[17,2,17,3],[25,4,25,5],[33,4,33,5],[14,4,14,5],[15,4,15,5],[16,4,16,5],[17,4,17,5],[25,6,25,7],[25,8,25,9],[24,4,24,5],[18,4,18,5],[3,10,3,11],[3,12,3,13],[4,6,4,7],[4,8,4,9],[4,10,4,11],[4,12,4,13],[3,6,3,7],[3,8,3,9],[17,6,17,7],[17,8,17,9],[17,10,17,11],[17,12,17,13],[18,6,18,7],[18,8,18,9],[18,10,18,11],[18,12,18,13],[24,6,24,7],[24,8,24,9],[24,10,24,11],[24,12,24,13],[1,10,1,11],[1,12,1,13],[2,6,2,7],[2,8,2,9],[2,10,2,11],[2,12,2,13],[1,6,1,7],[1,8,1,9],[16,10,16,11],[16,12,16,13],[16,6,16,7],[16,8,16,9],[14,10,14,11],[14,12,14,13],[15,6,15,7],[15,8,15,9],[15,10,15,11],[15,12,15,13],[14,6,14,7],[14,8,14,9],[25,10,25,11],[25,12,25,13],[34,10,34,11],[34,12,34,13],[36,2,36,3],[36,4,36,5],[36,6,36,7],[36,8,36,9],[36,10,36,11],[36,12,36,13],[34,4,34,5],[35,4,35,5],[34,2,34,3],[35,2,35,3],[35,6,35,7],[35,8,35,9],[35,10,35,11],[35,12,35,13],[34,6,34,7],[34,8,34,9],[33,6,33,7],[33,8,33,9],[33,10,33,11],[33,12,33,13],[22,10,22,11],[22,12,22,13],[23,2,23,3],[23,4,23,5],[23,6,23,7],[23,8,23,9],[23,10,23,11],[23,12,23,13],[22,4,22,5],[22,6,22,7],[22,8,22,9]]}
["Berechnung des Viehbesatzes auf der Hauptfutterfläche:"]
["Jahr"]
["Betrieb"]
["Datum der Prüfung"]
["Hauptfutterfläche ha"]
["Tiergruppen","RGV","Tiere","Summe","Tiere","Summe","Tiere","Summe","Tiere","Summe","Tiere","Summe","Tiere","Summe"]
[]
[null,{"$f":"IF(ISERROR(VLOOKUP(A8,Stammdaten!$A$3:$B$13,2,FALSE)),\"\",VLOOKUP(A8,Stammdaten!$A$3:$B$13,2,FALSE))","v":""},null,{"$f":"IF(ISBLANK(C8),\"\",C8*$B$8)","v":""},null,{"$f":"IF(ISBLANK(E8),\"\",E8*$B$8)","v":""},null,{"$f":"IF(ISBLANK(G8),\"\",G8*$B$8)","v":""},null,{"$f":"IF(ISBLANK(I8),\"\",I8*$B$8)","v":""},null,{"$f":"IF(ISBLANK(K8),\"\",K8*$B$8)","v":""},null,{"$f":"IF(ISBLANK(M8),\"\",M8*$B$8)","v":""}]
[null,{"$f":"IF(ISERROR(VLOOKUP(A9,Stammdaten!$A$3:$B$13,2,FALSE)),\"\",VLOOKUP(A9,Stammdaten!$A$3:$B$13,2,FALSE))","v":""},null,{"$f":"IF(ISBLANK(C9),\"\",C9*$B$9)","v":""},null,{"$f":"IF(ISBLANK(E9),\"\",E9*$B$9)","v":""},null,{"$f":"IF(ISBLANK(G9),\"\",G9*$B$9)","v":""},null,{"$f":"IF(ISBLANK(I9),\"\",I9*$B$9)","v":""},null,{"$f":"IF(ISBLANK(K9),\"\",K9*$B$9)","v":""},null,{"$f":"IF(ISBLANK(M9),\"\",M9*$B$9)","v":""}]
[null,{"$f":"IF(ISERROR(VLOOKUP(A10,Stammdaten!$A$3:$B$13,2,FALSE)),\"\",VLOOKUP(A10,Stammdaten!$A$3:$B$13,2,FALSE))","v":""},null,{"$f":"IF(ISBLANK(C10),\"\",C10*$B$10)","v":""},null,{"$f":"IF(ISBLANK(E10),\"\",E10*$B$10)","v":""},null,{"$f":"IF(ISBLANK(G10),\"\",G10*$B$10)","v":""},null,{"$f":"IF(ISBLANK(I10),\"\",I10*$B$10)","v":""},null,{"$f":"IF(ISBLANK(K10),\"\",K10*$B$10)","v":""},null,{"$f":"IF(ISBLANK(M10),\"\",M10*$B$10)","v":""}]
[null,{"$f":"IF(ISERROR(VLOOKUP(A11,Stammdaten!$A$3:$B$13,2,FALSE)),\"\",VLOOKUP(A11,Stammdaten!$A$3:$B$13,2,FALSE))","v":""},null,{"$f":"IF(ISBLANK(C11),\"\",C11*$B$11)","v":""},null,{"$f":"IF(ISBLANK(E11),\"\",E11*$B$11)","v":""},null,{"$f":"IF(ISBLANK(G11),\"\",G11*$B$11)","v":""},null,{"$f":"IF(ISBLANK(I11),\"\",I11*$B$11)","v":""},null,{"$f":"IF(ISBLANK(K11),\"\",K11*$B$11)","v":""},null,{"$f":"IF(ISBLANK(M11),\"\",M11*$B$11)","v":""}]
[null,{"$f":"IF(ISERROR(VLOOKUP(A12,Stammdaten!$A$3:$B$13,2,FALSE)),\"\",VLOOKUP(A12,Stammdaten!$A$3:$B$13,2,FALSE))","v":""},null,{"$f":"IF(ISBLANK(C12),\"\",C12*$B$12)","v":""},null,{"$f":"IF(ISBLANK(E12),\"\",E12*$B$12)","v":""},null,{"$f":"IF(ISBLANK(G12),\"\",G12*$B$12)","v":""},null,{"$f":"IF(ISBLANK(I12),\"\",I12*$B$12)","v":""},null,{"$f":"IF(ISBLANK(K12),\"\",K12*$B$12)","v":""},null,{"$f":"IF(ISBLANK(M12),\"\",M12*$B$12)","v":""}]
[null,{"$f":"IF(ISERROR(VLOOKUP(A13,Stammdaten!$A$3:$B$13,2,FALSE)),\"\",VLOOKUP(A13,Stammdaten!$A$3:$B$13,2,FALSE))","v":""},null,{"$f":"IF(ISBLANK(C13),\"\",C13*$B$13)","v":""},null,{"$f":"IF(ISBLANK(E13),\"\",E13*$B$13)","v":""},null,{"$f":"IF(ISBLANK(G13),\"\",G13*$B$13)","v":""},null,{"$f":"IF(ISBLANK(I13),\"\",I13*$B$13)","v":""},null,{"$f":"IF(ISBLANK(K13),\"\",K13*$B$13)","v":""},null,{"$f":"IF(ISBLANK(M13),\"\",M13*$B$13)","v":""}]
[null,null,50,{"$f":"IF(ISBLANK(C14),\"\",C14*B14)","v":0},null,{"$f":"IF(ISBLANK(E14),\"\",E14*D14)","v":""},null,{"$f":"IF(ISBLANK(G14),\"\",G14*F14)","v":""},null,{"$f":"IF(ISBLANK(I14),\"\",I14*H14)","v":""},null,{"$f":"IF(ISBLANK(K14),\"\",K14*J14)","v":""},null,{"$f":"IF(ISBLANK(M14),\"\",M14*L14)","v":""}]
["Summe RGV",null,{"$f":"SUM(D8:D14)","v":0},null,{"$f":"SUM(F8:F14)","v":0},null,{"$f":"SUM(H8:H14)","v":0},null,{"$f":"SUM(J8:J14)","v":0},null,{"$f":"SUM(L8:L14)","v":0},null,{"$f":"SUM(N8:N14)","v":0}]
["Viehbesatz pro Tag ",null,{"$f":"IF(ISBLANK(C$5),\"\",(C15/C$5))","v":""},null,{"$f":"IF(ISBLANK(E$5),\"\",(E15/E$5))","v":""},null,{"$f":"IF(ISBLANK(G$5),\"\",(G15/G$5))","v":""},null,{"$f":"IF(ISBLANK(I$5),\"\",(I15/I$5))","v":""},null,{"$f":"IF(ISBLANK(K$5),\"\",(K15/K$5))","v":""},null,{"$f":"IF(ISBLANK(M$5),\"\",(M15/M$5))","v":""}]
[{"$f":"Stammdaten!$A$21","v":"Min. Viehbesatz pro Tag"},{"$f":"Stammdaten!$D$21","v":0.3},{"$f":"IF(ISBLANK(C$5),\"\",IF(C16<$B$17,\"Falsch\",\"OK\"))","v":""},null,{"$f":"IF(ISBLANK(E$5),\"\",IF(E16<$B$17,\"Falsch\",\"OK\"))","v":""},null,{"$f":"IF(ISBLANK(G$5),\"\",IF(G16<$B$17,\"Falsch\",\"OK\"))","v":""},null,{"$f":"IF(ISBLANK(I$5),\"\",IF(I16<$B$17,\"Falsch\",\"OK\"))","v":""},null,{"$f":"IF(ISBLANK(K$5),\"\",IF(K16<$B$17,\"Falsch\",\"OK\"))","v":""},null,{"$f":"IF(ISBLANK(M$5),\"\",IF(M16<$B$17,\"Falsch\",\"OK\"))","v":""}]
[{"$f":"Stammdaten!$A$22","v":"Max. Viehbesatz pro Tag"},{"$f":"Stammdaten!$D$25","v":1.4},{"$f":"IF(ISBLANK(C$5),\"\",IF(C16>$B$18,\"Falsch\",\"OK\"))","v":""},null,{"$f":"IF(ISBLANK(E$5),\"\",IF(E16>$B$18,\"Falsch\",\"OK\"))","v":""},null,{"$f":"IF(ISBLANK(G$5),\"\",IF(G16>$B$18,\"Falsch\",\"OK\"))","v":""},null,{"$f":"IF(ISBLANK(I$5),\"\",IF(I16>$B$18,\"Falsch\",\"OK\"))","v":""},null,{"$f":"IF(ISBLANK(K$5),\"\",IF(K16>$B$18,\"Falsch\",\"OK\"))","v":""},null,{"$f":"IF(ISBLANK(M$5),\"\",IF(M16>$B$18,\"Falsch\",\"OK\"))","v":""}]
[{"$f":"Stammdaten!A23","v":"Max. Viehbesatz pro Tag Zusatzmodul Extensiv"},{"$f":"Stammdaten!D23","v":1},{"$f":"IF(ISBLANK(C$5),\"\",IF(C16>$B$19,\"Falsch\",\"OK\"))","v":""},null,{"$f":"IF(ISBLANK(E$5),\"\",IF(E16>$B$19,\"Falsch\",\"OK\"))","v":""},null,{"$f":"IF(ISBLANK(G$5),\"\",IF(G16>$B$19,\"Falsch\",\"OK\"))","v":""},null,{"$f":"IF(ISBLANK(I$5),\"\",IF(I16>$B$19,\"Falsch\",\"OK\"))","v":""},null,{"$f":"IF(ISBLANK(K$5),\"\",IF(K16>$B$19,\"Falsch\",\"OK\"))","v":""},null,{"$f":"IF(ISBLANK(M$5),\"\",IF(M16>$B$19,\"Falsch\",\"OK\"))","v":""}]
[]
[]
["Berechnung des Viehbesatzes auf der landwirtschaftlichen Fläche (LF) \nfür die Ausbringung organischer Dünger:"]
["Jahr"]
["Betrieb"]
["Datum der Prüfung"]
["Landwirtschaftliche Fläche LF ha"]
["Andere Tiergruppen","GVE",{"$f":"C6","v":"Tiere"},{"$f":"D6","v":"Summe"},{"$f":"E6","v":"Tiere"},{"$f":"F6","v":"Summe"},{"$f":"G6","v":"Tiere"},"Summe","Tiere","Summe","Tiere","Summe","Tiere","Summe"]
[null,{"$f":"IF(ISERROR(VLOOKUP(A28,Stammdaten!$A$37:$B$54,2,FALSE)),\"\",VLOOKUP(A28,Stammdaten!$A$37:$B$54,2,FALSE))","v":""},null,{"$f":"IF(ISBLANK(C28),\"\",C28*$B$28)","v":""},null,{"$f":"IF(ISBLANK(E28),\"\",E28*$B$28)","v":""},null,{"$f":"IF(ISBLANK(G28),\"\",G28*$B$28)","v":""},null,{"$f":"IF(ISBLANK(I28),\"\",I28*$B$28)","v":""},null,{"$f":"IF(ISBLANK(K28),\"\",K28*$B$28)","v":""},null,{"$f":"IF(ISBLANK(M28),\"\",M28*$B$28)","v":""}]
[null,{"$f":"IF(ISERROR(VLOOKUP(A29,Stammdaten!$A$37:$B$54,2,FALSE)),\"\",VLOOKUP(A29,Stammdaten!$A$37:$B$54,2,FALSE))","v":""},null,{"$f":"IF(ISBLANK(C29),\"\",C29*$B$29)","v":""},null,{"$f":"IF(ISBLANK(E29),\"\",E29*$B$29)","v":""},null,{"$f":"IF(ISBLANK(G29),\"\",G29*$B$29)","v":""},null,{"$f":"IF(ISBLANK(I29),\"\",I29*$B$29)","v":""},null,{"$f":"IF(ISBLANK(K29),\"\",K29*$B$29)","v":""},null,{"$f":"IF(ISBLANK(M29),\"\",M29*$B$29)","v":""}]
[null,{"$f":"IF(ISERROR(VLOOKUP(A30,Stammdaten!$A$37:$B$54,2,FALSE)),\"\",VLOOKUP(A30,Stammdaten!$A$37:$B$54,2,FALSE))","v":""},null,{"$f":"IF(ISBLANK(C30),\"\",C30*$B$30)","v":""},null,{"$f":"IF(ISBLANK(E30),\"\",E30*$B$30)","v":""},null,{"$f":"IF(ISBLANK(G30),\"\",G30*$B$30)","v":""},null,{"$f":"IF(ISBLANK(I30),\"\",I30*$B$30)","v":""},null,{"$f":"IF(ISBLANK(K30),\"\",K30*$B$30)","v":""},null,{"$f":"IF(ISBLANK(M30),\"\",M30*$B$30)","v":""}]
{"$rows_left_out":41}
{"sheet":"Andere","index":5,"n_rows":38,"n_cols":17,"rows_kept":38,"cut":false,"hidden":false,"merged":[]}
["Jahr"]
["Betrieb"]
["Schlag"]
["Nutzungart (Weide, Mähweide, ganzjährig)"]
["Flächengröße  ha"]
["Datum Auftrieb oder Alterswechsel"]
["Datum Abtrieb oder Alterswechsel"]
["Tiergruppen","RGV","Tiere","Tiere","Tiere","Tiere","Tiere","Tiere","Tiere","Tiere","Tiere","Tiere","Tiere","Tiere","Tiere","Tiere","Tiere"]
[]
[null,{"$f":"IF(ISERROR(VLOOKUP(A10,Stammdaten!$A$3:$B$13,2,FALSE)),\"\",VLOOKUP(A10,Stammdaten!$A$3:$B$13,2,FALSE))","v":""}]
[null,{"$f":"IF(ISERROR(VLOOKUP(A11,Stammdaten!$A$3:$B$13,2,FALSE)),\"\",VLOOKUP(A11,Stammdaten!$A$3:$B$13,2,FALSE))","v":""}]
[null,{"$f":"IF(ISERROR(VLOOKUP(A12,Stammdaten!$A$3:$B$13,2,FALSE)),\"\",VLOOKUP(A12,Stammdaten!$A$3:$B$13,2,FALSE))","v":""}]
[null,{"$f":"IF(ISERROR(VLOOKUP(A13,Stammdaten!$A$3:$B$13,2,FALSE)),\"\",VLOOKUP(A13,Stammdaten!$A$3:$B$13,2,FALSE))","v":""}]
[null,{"$f":"IF(ISERROR(VLOOKUP(A14,Stammdaten!$A$3:$B$13,2,FALSE)),\"\",VLOOKUP(A14,Stammdaten!$A$3:$B$13,2,FALSE))","v":""}]
[null,{"$f":"IF(ISERROR(VLOOKUP(A15,Stammdaten!$A$3:$B$13,2,FALSE)),\"\",VLOOKUP(A15,Stammdaten!$A$3:$B$13,2,FALSE))","v":""}]
[]
["Summe RGV",null,{"$f":"SUMPRODUCT($B$10:$B$15,C10:C15)","v":0},{"$f":"SUMPRODUCT($B$10:$B$15,D10:D15)","v":0},0,0,0,0,0,0,0,0,0,0,0,0,0]
["Anzahl Weidetage",null,{"$f":"IF(ISBLANK(C6),360,DAYS360(C6,C7))","v":360},360,360,360,360,360,360,360,360,360,360,360,360,360,360]
["ohne Alterswechsel im Beweidungszeitraum"]
["Viehbesatz pro Tag ",null,{"$f":"IF(ISBLANK(C$5),\"\",(C$17/C$5))","v":""},"","","","","","","","","","","","","",""]
["Viehbesatz Durchschnitt Jahr",null,{"$f":"IF(ISBLANK(C$5),\"\",C$17/C$5/360*C$18)","v":""},"","","","","","","","","","","","","",""]
["mit Alterswechsel im Beweidungszeitraum"]
["Viehbesatz Summe pro Zeitraum",null,{"$f":"IF(ISBLANK(C$5),\"\",C20*C18)","v":""},{"$f":"IF(ISBLANK(D$5),\"\",D20*D18)","v":""},{"$f":"IF(ISBLANK(E$5),\"\",E20*E18)","v":""},"","","","","","","",{"$f":"IF(ISBLANK(M$5),\"\",M20*M18)","v":""},{"$f":"IF(ISBLANK(N$5),\"\",N20*N18)","v":""},{"$f":"IF(ISBLANK(O$5),\"\",O20*O18)","v":""},{"$f":"IF(ISBLANK(P$5),\"\",P20*P18)","v":""},{"$f":"IF(ISBLANK(Q$5),\"\",Q20*Q18)","v":""}]
["Viehbesatz Durchschnitt Jahr",null,{"$f":"SUM(C23:Q23)/360","v":0}]
[]
[]
["Tiergruppen"]
["Kälber und Jungvieh unter 6 Monate"]
["Rinder von 6 Monaten bis 2 Jahren"]
["Rinder von mehr als 2 Jahren / Milchkühe"]
{"$rows_left_out":9}
{"sheet":"mögliche Weidetage berechnen","index":6,"n_rows":39,"n_cols":17,"rows_kept":39,"cut":false,"hidden":false,"merged":[[1,2,1,16],[2,2,2,16],[3,2,3,16]]}
[null,"bitte hier wählen:"]
["Berechnung durchführen für Programmteil:","GMW",{"$f":"VLOOKUP(B2,Stammdaten!A57:B59,2,FALSE)","v":"Vertragsnaturschutz Mähwiesen und Weiden"}]
["Jahr"]
["Betrieb"]
["Schlag"]
["Nutzungart (Weide, Mähweide, ganzjährig)"]
["Flächengröße  ha:"]
["Datum Auftrieb oder Beginn der Beweidung (optional)"]
["Datum Abtrieb oder Ende der Beweidung  (optional)"]
["Tiergruppen","RGV","Tiere","Tiere","Tiere","Tiere","Tiere","Tiere","Tiere","Tiere","Tiere","Tiere","Tiere","Tiere","Tiere","Tiere","Tiere"]
[]
[null,{"$f":"IF(ISERROR(VLOOKUP(A12,Stammdaten!$A$3:$B$13,2,FALSE)),\"\",VLOOKUP(A12,Stammdaten!$A$3:$B$13,2,FALSE))","v":""}]
[null,{"$f":"IF(ISERROR(VLOOKUP(A13,Stammdaten!$A$3:$B$13,2,FALSE)),\"\",VLOOKUP(A13,Stammdaten!$A$3:$B$13,2,FALSE))","v":""}]
[null,{"$f":"IF(ISERROR(VLOOKUP(A14,Stammdaten!$A$3:$B$13,2,FALSE)),\"\",VLOOKUP(A14,Stammdaten!$A$3:$B$13,2,FALSE))","v":""}]
[null,{"$f":"IF(ISERROR(VLOOKUP(A15,Stammdaten!$A$3:$B$13,2,FALSE)),\"\",VLOOKUP(A15,Stammdaten!$A$3:$B$13,2,FALSE))","v":""}]
[null,{"$f":"IF(ISERROR(VLOOKUP(A16,Stammdaten!$A$3:$B$13,2,FALSE)),\"\",VLOOKUP(A16,Stammdaten!$A$3:$B$13,2,FALSE))","v":""}]
[null,{"$f":"IF(ISERROR(VLOOKUP(A17,Stammdaten!$A$3:$B$13,2,FALSE)),\"\",VLOOKUP(A17,Stammdaten!$A$3:$B$13,2,FALSE))","v":""}]
[null,{"$f":"IF(ISERROR(VLOOKUP(A18,Stammdaten!$A$3:$B$13,2,FALSE)),\"\",VLOOKUP(A18,Stammdaten!$A$3:$B$13,2,FALSE))","v":""}]
["Summe RGV",null,{"$f":"SUMPRODUCT($B$12:$B$17,C12:C17)","v":0},{"$f":"SUMPRODUCT($B$12:$B$17,D12:D17)","v":0},0,0,0,0,0,0,0,0,0,0,0,0,0]
["aktuelle Weidetage ",null,{"$f":"DAYS360(C8,C9)","v":0},0,0,0,0,0,0,0,0,0,0,0,0,0,0]
["Viehbesatz pro Tag ",null,{"$f":"IF(ISBLANK(C$7),\"\",(C$19/C$7))","v":""},"",{"$f":"IF(ISBLANK(E$7),\"\",(E$19/E$7))","v":""},"","","","","","","","","","","",""]
["Viehbesatz Durchschnitt Jahr",null,{"$f":"IF(ISBLANK(C$7),\"\",C$19/C$7/360*C$20)","v":""},"","","","","","","","","","","","","",""]
["Hier werden die möglichen Weidetage angezeigt:"]
["MIN  Anzahl Weidetage bei ausschließlicher Weidenutzung",{"$f":"VLOOKUP($B$2,Stammdaten!$A$57:$E$58,3,FALSE)","v":0.3},{"$f":"IF(OR(ISERROR(OR(C$7,C$19)),OR(C$7=0,C$19=0)),\"\",$B$24*360*C$7/C$19)","v":""},{"$f":"IF(OR(ISERROR(OR(D7,D19)),OR(D7=0,D19=0)),\"\",$B$24*360*D7/D19)","v":""},"","","","","","","","","","","","",""]
["MAX Anzahl Weidetage bei ausschließlicher Weidenutzung",{"$f":"VLOOKUP($B$2,Stammdaten!$A$57:$E$58,4,FALSE)","v":1.2},{"$f":"IF(OR(ISERROR(OR(C$7,C$19)),OR(C$7=0,C$19=0)),\"\",$B$25*360*C$7/C$19)","v":""},{"$f":"IF(OR(ISERROR(OR(D$7,D$19)),OR(D$7=0,D$19=0)),\"\",$B$25*360*D$7/D$19)","v":""},"","","","","","","","","","","","",""]
["MAX Anzahl Weidetage bei Mähweidenutzung",{"$f":"VLOOKUP($B$2,Stammdaten!$A$57:$E$58,5,FALSE)","v":0.6},{"$f":"IF(OR(ISERROR(OR(C$7,C$19)),OR(C$7=0,C$19=0)),\"\",$B$26*360*C$7/C$19)","v":""},{"$f":"IF(OR(ISERROR(OR(D$7,D$19)),OR(D$7=0,D$19=0)),\"\",$B$26*360*D$7/D$19)","v":""},"","","","","","","","","","","","",""]
[]
["Tiergruppen"]
["Kälber und Jungvieh unter 6 Monate"]
["Rinder von 6 Monaten bis 2 Jahren"]
{"$rows_left_out":9}